{"text_format":"1","workbook":"xlsx","n_sheets":3,"sheets":["Ingresar DATOS","CUADRO INFORMATIVO","Proceso"],"not_rendered":{"charts":0,"images":0,"macros":1,"external_links":0,"defined_names":0,"comments":0,"pivot_tables":0},"unopened":[],"bounds":{"document_bytes":16777216,"sheet_cells":100000,"rows_first":2000,"rows_last":500,"rows_between":2000,"halvings":0,"cell_chars":16384,"cell_head_chars":4096},"cells_cut":0,"cells_raw":0,"read":"whole","date_system":"1900"}

{"sheet":"Ingresar DATOS","index":0,"n_rows":322,"n_cols":5,"rows_kept":322,"cut":false,"hidden":false,"merged":[[321,0,321,4]]}
[]
["PUNTO","NORTE","ESTE","COTA","DESCRIPCION"]
[]
[]
[]
[]
[]
[]
[]
[]
[]
[]
[]
[]
[]
[]
[]
[]
[]
[]
[]
[]
[]
[]
[]
[]
[]
[]
[]
[]
{"$rows_left_out":293}
{"sheet":"CUADRO INFORMATIVO","index":1,"n_rows":322,"n_cols":8,"rows_kept":322,"cut":false,"hidden":false,"merged":[[2,1,2,2],[2,6,2,7],[1,1,1,7],[2,3,3,3],[2,4,3,4],[2,5,3,5]]}
[]
[null,"CUADRO INFORMATIVO DEL PREDIO"]
[null,"LADO",null,"RUMBO","DISTANCIA","V","COORDENADAS"]
[null,"EST","PV",null,null,null,"NORTE","ESTE"]
[null,null,null,null,null,null,{"$f":"IFERROR(IF(F5=0,\" \",VLOOKUP(F5,'Ingresar DATOS'!$A$3:$C$320,2,FALSE)),\" \")","v":" "},{"$f":"IFERROR(IF(F5=0,\" \",VLOOKUP(F5,'Ingresar DATOS'!$A$3:$C$320,3,FALSE)),\" \")","v":" "}]
[null,{"$f":"IF(F6<>0,F5,\" \")","v":" "},{"$f":"IF(F6<>0,F6,\" \")","v":" "},{"$f":"IFERROR(VLOOKUP(B6,Proceso!$A$2:$R$319,18,),\" \")","v":" "},{"$f":"IFERROR(VLOOKUP(B6,Proceso!$A$2:$F$319,6,),\" \")","v":" "},null,{"$f":"IFERROR(IF(F6=0,\" \",VLOOKUP(F6,'Ingresar DATOS'!$A$3:$C$320,2,FALSE)),\" \")","v":" "},{"$f":"IFERROR(IF(F6=0,\" \",VLOOKUP(F6,'Ingresar DATOS'!$A$3:$C$320,3,FALSE)),\" \")","v":" "}]
[null,{"$f":"IF(F7<>0,F6,\" \")","v":" "},{"$f":"IF(F7<>0,F7,\" \")","v":" "},{"$f":"IFERROR(VLOOKUP(B7,Proceso!$A$2:$R$319,18,),\" \")","v":" "},{"$f":"IFERROR(VLOOKUP(B7,Proceso!$A$2:$F$319,6,),\" \")","v":" "},null,{"$f":"IFERROR(IF(F7=0,\" \",VLOOKUP(F7,'Ingresar DATOS'!$A$3:$C$320,2,FALSE)),\" \")","v":" "},{"$f":"IFERROR(IF(F7=0,\" \",VLOOKUP(F7,'Ingresar DATOS'!$A$3:$C$320,3,FALSE)),\" \")","v":" "}]
[null," "," ",{"$f":"IFERROR(VLOOKUP(B8,Proceso!$A$2:$R$319,18,),\" \")","v":" "},{"$f":"IFERROR(VLOOKUP(B8,Proceso!$A$2:$F$319,6,),\" \")","v":" "},null,{"$f":"IFERROR(IF(F8=0,\" \",VLOOKUP(F8,'Ingresar DATOS'!$A$3:$C$320,2,FALSE)),\" \")","v":" "},{"$f":"IFERROR(IF(F8=0,\" \",VLOOKUP(F8,'Ingresar DATOS'!$A$3:$C$320,3,FALSE)),\" \")","v":" "}]
[null," "," ",{"$f":"IFERROR(VLOOKUP(B9,Proceso!$A$2:$R$319,18,),\" \")","v":" "},{"$f":"IFERROR(VLOOKUP(B9,Proceso!$A$2:$F$319,6,),\" \")","v":" "},null,{"$f":"IFERROR(IF(F9=0,\" \",VLOOKUP(F9,'Ingresar DATOS'!$A$3:$C$320,2,FALSE)),\" \")","v":" "},{"$f":"IFERROR(IF(F9=0,\" \",VLOOKUP(F9,'Ingresar DATOS'!$A$3:$C$320,3,FALSE)),\" \")","v":" "}]
[null," "," ",{"$f":"IFERROR(VLOOKUP(B10,Proceso!$A$2:$R$319,18,),\" \")","v":" "},{"$f":"IFERROR(VLOOKUP(B10,Proceso!$A$2:$F$319,6,),\" \")","v":" "},null,{"$f":"IFERROR(IF(F10=0,\" \",VLOOKUP(F10,'Ingresar DATOS'!$A$3:$C$320,2,FALSE)),\" \")","v":" "},{"$f":"IFERROR(IF(F10=0,\" \",VLOOKUP(F10,'Ingresar DATOS'!$A$3:$C$320,3,FALSE)),\" \")","v":" "}]
[null," "," ",{"$f":"IFERROR(VLOOKUP(B11,Proceso!$A$2:$R$319,18,),\" \")","v":" "},{"$f":"IFERROR(VLOOKUP(B11,Proceso!$A$2:$F$319,6,),\" \")","v":" "},null,{"$f":"IFERROR(IF(F11=0,\" \",VLOOKUP(F11,'Ingresar DATOS'!$A$3:$C$320,2,FALSE)),\" \")","v":" "},{"$f":"IFERROR(IF(F11=0,\" \",VLOOKUP(F11,'Ingresar DATOS'!$A$3:$C$320,3,FALSE)),\" \")","v":" "}]
[null," "," ",{"$f":"IFERROR(VLOOKUP(B12,Proceso!$A$2:$R$319,18,),\" \")","v":" "},{"$f":"IFERROR(VLOOKUP(B12,Proceso!$A$2:$F$319,6,),\" \")","v":" "},null,{"$f":"IFERROR(IF(F12=0,\" \",VLOOKUP(F12,'Ingresar DATOS'!$A$3:$C$320,2,FALSE)),\" \")","v":" "},{"$f":"IFERROR(IF(F12=0,\" \",VLOOKUP(F12,'Ingresar DATOS'!$A$3:$C$320,3,FALSE)),\" \")","v":" "}]
[null," "," ",{"$f":"IFERROR(VLOOKUP(B13,Proceso!$A$2:$R$319,18,),\" \")","v":" "},{"$f":"IFERROR(VLOOKUP(B13,Proceso!$A$2:$F$319,6,),\" \")","v":" "},null,{"$f":"IFERROR(IF(F13=0,\" \",VLOOKUP(F13,'Ingresar DATOS'!$A$3:$C$320,2,FALSE)),\" \")","v":" "},{"$f":"IFERROR(IF(F13=0,\" \",VLOOKUP(F13,'Ingresar DATOS'!$A$3:$C$320,3,FALSE)),\" \")","v":" "}]
[null," "," ",{"$f":"IFERROR(VLOOKUP(B14,Proceso!$A$2:$R$319,18,),\" \")","v":" "},{"$f":"IFERROR(VLOOKUP(B14,Proceso!$A$2:$F$319,6,),\" \")","v":" "},null,{"$f":"IFERROR(IF(F14=0,\" \",VLOOKUP(F14,'Ingresar DATOS'!$A$3:$C$320,2,FALSE)),\" \")","v":" "},{"$f":"IFERROR(IF(F14=0,\" \",VLOOKUP(F14,'Ingresar DATOS'!$A$3:$C$320,3,FALSE)),\" \")","v":" "}]
[null," "," ",{"$f":"IFERROR(VLOOKUP(B15,Proceso!$A$2:$R$319,18,),\" \")","v":" "},{"$f":"IFERROR(VLOOKUP(B15,Proceso!$A$2:$F$319,6,),\" \")","v":" "},null,{"$f":"IFERROR(IF(F15=0,\" \",VLOOKUP(F15,'Ingresar DATOS'!$A$3:$C$320,2,FALSE)),\" \")","v":" "},{"$f":"IFERROR(IF(F15=0,\" \",VLOOKUP(F15,'Ingresar DATOS'!$A$3:$C$320,3,FALSE)),\" \")","v":" "}]
[null," "," ",{"$f":"IFERROR(VLOOKUP(B16,Proceso!$A$2:$R$319,18,),\" \")","v":" "},{"$f":"IFERROR(VLOOKUP(B16,Proceso!$A$2:$F$319,6,),\" \")","v":" "},null,{"$f":"IFERROR(IF(F16=0,\" \",VLOOKUP(F16,'Ingresar DATOS'!$A$3:$C$320,2,FALSE)),\" \")","v":" "},{"$f":"IFERROR(IF(F16=0,\" \",VLOOKUP(F16,'Ingresar DATOS'!$A$3:$C$320,3,FALSE)),\" \")","v":" "}]
[null," "," ",{"$f":"IFERROR(VLOOKUP(B17,Proceso!$A$2:$R$319,18,),\" \")","v":" "},{"$f":"IFERROR(VLOOKUP(B17,Proceso!$A$2:$F$319,6,),\" \")","v":" "},null,{"$f":"IFERROR(IF(F17=0,\" \",VLOOKUP(F17,'Ingresar DATOS'!$A$3:$C$320,2,FALSE)),\" \")","v":" "},{"$f":"IFERROR(IF(F17=0,\" \",VLOOKUP(F17,'Ingresar DATOS'!$A$3:$C$320,3,FALSE)),\" \")","v":" "}]
[null," "," ",{"$f":"IFERROR(VLOOKUP(B18,Proceso!$A$2:$R$319,18,),\" \")","v":" "},{"$f":"IFERROR(VLOOKUP(B18,Proceso!$A$2:$F$319,6,),\" \")","v":" "},null,{"$f":"IFERROR(IF(F18=0,\" \",VLOOKUP(F18,'Ingresar DATOS'!$A$3:$C$320,2,FALSE)),\" \")","v":" "},{"$f":"IFERROR(IF(F18=0,\" \",VLOOKUP(F18,'Ingresar DATOS'!$A$3:$C$320,3,FALSE)),\" \")","v":" "}]
[null," "," ",{"$f":"IFERROR(VLOOKUP(B19,Proceso!$A$2:$R$319,18,),\" \")","v":" "},{"$f":"IFERROR(VLOOKUP(B19,Proceso!$A$2:$F$319,6,),\" \")","v":" "},null,{"$f":"IFERROR(IF(F19=0,\" \",VLOOKUP(F19,'Ingresar DATOS'!$A$3:$C$320,2,FALSE)),\" \")","v":" "},{"$f":"IFERROR(IF(F19=0,\" \",VLOOKUP(F19,'Ingresar DATOS'!$A$3:$C$320,3,FALSE)),\" \")","v":" "}]
[null," "," ",{"$f":"IFERROR(VLOOKUP(B20,Proceso!$A$2:$R$319,18,),\" \")","v":" "},{"$f":"IFERROR(VLOOKUP(B20,Proceso!$A$2:$F$319,6,),\" \")","v":" "},null,{"$f":"IFERROR(IF(F20=0,\" \",VLOOKUP(F20,'Ingresar DATOS'!$A$3:$C$320,2,FALSE)),\" \")","v":" "},{"$f":"IFERROR(IF(F20=0,\" \",VLOOKUP(F20,'Ingresar DATOS'!$A$3:$C$320,3,FALSE)),\" \")","v":" "}]
[null," "," ",{"$f":"IFERROR(VLOOKUP(B21,Proceso!$A$2:$R$319,18,),\" \")","v":" "},{"$f":"IFERROR(VLOOKUP(B21,Proceso!$A$2:$F$319,6,),\" \")","v":" "},null,{"$f":"IFERROR(IF(F21=0,\" \",VLOOKUP(F21,'Ingresar DATOS'!$A$3:$C$320,2,FALSE)),\" \")","v":" "},{"$f":"IFERROR(IF(F21=0,\" \",VLOOKUP(F21,'Ingresar DATOS'!$A$3:$C$320,3,FALSE)),\" \")","v":" "}]
[null," "," ",{"$f":"IFERROR(VLOOKUP(B22,Proceso!$A$2:$R$319,18,),\" \")","v":" "},{"$f":"IFERROR(VLOOKUP(B22,Proceso!$A$2:$F$319,6,),\" \")","v":" "},null,{"$f":"IFERROR(IF(F22=0,\" \",VLOOKUP(F22,'Ingresar DATOS'!$A$3:$C$320,2,FALSE)),\" \")","v":" "},{"$f":"IFERROR(IF(F22=0,\" \",VLOOKUP(F22,'Ingresar DATOS'!$A$3:$C$320,3,FALSE)),\" \")","v":" "}]
[null," "," ",{"$f":"IFERROR(VLOOKUP(B23,Proceso!$A$2:$R$319,18,),\" \")","v":" "},{"$f":"IFERROR(VLOOKUP(B23,Proceso!$A$2:$F$319,6,),\" \")","v":" "},null,{"$f":"IFERROR(IF(F23=0,\" \",VLOOKUP(F23,'Ingresar DATOS'!$A$3:$C$320,2,FALSE)),\" \")","v":" "},{"$f":"IFERROR(IF(F23=0,\" \",VLOOKUP(F23,'Ingresar DATOS'!$A$3:$C$320,3,FALSE)),\" \")","v":" "}]
[null," "," ",{"$f":"IFERROR(VLOOKUP(B24,Proceso!$A$2:$R$319,18,),\" \")","v":" "},{"$f":"IFERROR(VLOOKUP(B24,Proceso!$A$2:$F$319,6,),\" \")","v":" "},null,{"$f":"IFERROR(IF(F24=0,\" \",VLOOKUP(F24,'Ingresar DATOS'!$A$3:$C$320,2,FALSE)),\" \")","v":" "},{"$f":"IFERROR(IF(F24=0,\" \",VLOOKUP(F24,'Ingresar DATOS'!$A$3:$C$320,3,FALSE)),\" \")","v":" "}]
[null," "," ",{"$f":"IFERROR(VLOOKUP(B25,Proceso!$A$2:$R$319,18,),\" \")","v":" "},{"$f":"IFERROR(VLOOKUP(B25,Proceso!$A$2:$F$319,6,),\" \")","v":" "},null,{"$f":"IFERROR(IF(F25=0,\" \",VLOOKUP(F25,'Ingresar DATOS'!$A$3:$C$320,2,FALSE)),\" \")","v":" "},{"$f":"IFERROR(IF(F25=0,\" \",VLOOKUP(F25,'Ingresar DATOS'!$A$3:$C$320,3,FALSE)),\" \")","v":" "}]
[null," "," ",{"$f":"IFERROR(VLOOKUP(B26,Proceso!$A$2:$R$319,18,),\" \")","v":" "},{"$f":"IFERROR(VLOOKUP(B26,Proceso!$A$2:$F$319,6,),\" \")","v":" "},null,{"$f":"IFERROR(IF(F26=0,\" \",VLOOKUP(F26,'Ingresar DATOS'!$A$3:$C$320,2,FALSE)),\" \")","v":" "},{"$f":"IFERROR(IF(F26=0,\" \",VLOOKUP(F26,'Ingresar DATOS'!$A$3:$C$320,3,FALSE)),\" \")","v":" "}]
[null," "," ",{"$f":"IFERROR(VLOOKUP(B27,Proceso!$A$2:$R$319,18,),\" \")","v":" "},{"$f":"IFERROR(VLOOKUP(B27,Proceso!$A$2:$F$319,6,),\" \")","v":" "},null,{"$f":"IFERROR(IF(F27=0,\" \",VLOOKUP(F27,'Ingresar DATOS'!$A$3:$C$320,2,FALSE)),\" \")","v":" "},{"$f":"IFERROR(IF(F27=0,\" \",VLOOKUP(F27,'Ingresar DATOS'!$A$3:$C$320,3,FALSE)),\" \")","v":" "}]
[null," "," ",{"$f":"IFERROR(VLOOKUP(B28,Proceso!$A$2:$R$319,18,),\" \")","v":" "},{"$f":"IFERROR(VLOOKUP(B28,Proceso!$A$2:$F$319,6,),\" \")","v":" "},null,{"$f":"IFERROR(IF(F28=0,\" \",VLOOKUP(F28,'Ingresar DATOS'!$A$3:$C$320,2,FALSE)),\" \")","v":" "},{"$f":"IFERROR(IF(F28=0,\" \",VLOOKUP(F28,'Ingresar DATOS'!$A$3:$C$320,3,FALSE)),\" \")","v":" "}]
[null," "," ",{"$f":"IFERROR(VLOOKUP(B29,Proceso!$A$2:$R$319,18,),\" \")","v":" "},{"$f":"IFERROR(VLOOKUP(B29,Proceso!$A$2:$F$319,6,),\" \")","v":" "},null,{"$f":"IFERROR(IF(F29=0,\" \",VLOOKUP(F29,'Ingresar DATOS'!$A$3:$C$320,2,FALSE)),\" \")","v":" "},{"$f":"IFERROR(IF(F29=0,\" \",VLOOKUP(F29,'Ingresar DATOS'!$A$3:$C$320,3,FALSE)),\" \")","v":" "}]
[null," "," ",{"$f":"IFERROR(VLOOKUP(B30,Proceso!$A$2:$R$319,18,),\" \")","v":" "},{"$f":"IFERROR(VLOOKUP(B30,Proceso!$A$2:$F$319,6,),\" \")","v":" "},null,{"$f":"IFERROR(IF(F30=0,\" \",VLOOKUP(F30,'Ingresar DATOS'!$A$3:$C$320,2,FALSE)),\" \")","v":" "},{"$f":"IFERROR(IF(F30=0,\" \",VLOOKUP(F30,'Ingresar DATOS'!$A$3:$C$320,3,FALSE)),\" \")","v":" "}]
{"$rows_left_out":293}
{"sheet":"Proceso","index":2,"n_rows":319,"n_cols":18,"rows_kept":319,"cut":false,"hidden":true,"merged":[]}
["DATOS","N","E","Y","X","DH Corregida",null,null,null,"VALOR CORREGIDO","AZIMUT EN DECIMALES","Cuadrante",null,null,"RUMBO","Azimut en sexagesimales","Rumbo en Sexagesimales","RUMBO COMPLETO"]
[{"$f":"'CUADRO INFORMATIVO'!F5","v":0},{"$f":"'CUADRO INFORMATIVO'!G5","v":" "},{"$f":"'CUADRO INFORMATIVO'!H5","v":" "},{"$f":"IF(B2<>0,IF(B3=0,$B$2-B2,B3-B2),0)","v":{"$error":"#VALUE!"}},{"$f":"IF(C2<>0,IF(C3=0,$C$2-C2,C3-C2),0)","v":{"$error":"#VALUE!"}},{"$f":"SQRT((D2^2)+(E2^2))","v":{"$error":"#VALUE!"}},{"$f":"A2&\" - \"&A3","v":"0 - 0"},{"$f":"IF(D2>=0,\"+\",\"-\")&IF(E2>=0,\"+\",\"-\")","v":{"$error":"#VALUE!"}},{"$f":"DEGREES(ATAN(E2/D2))","v":{"$error":"#VALUE!"}},{"$f":"IF(H2=\"++\",I2,IF(H2=\"+-\",I2,IF(H2=\"-+\",I2-180,IF(H2=\"--\",I2+180))))","v":{"$error":"#VALUE!"}},{"$f":"IF(J2>=0,J2,360+J2)","v":{"$error":"#VALUE!"}},{"$f":"IF(K2<=90,1,IF(K2<=180,2,IF(K2<=270,3,IF(K2<=360,4))))","v":{"$error":"#VALUE!"}},{"$f":"IF(L2=1,\"N\",IF(L2=2,\"S\",IF(L2=3,\"S\",IF(L2=4,\"N\"))))","v":{"$error":"#VALUE!"}},{"$f":"IF(L2=1,\"E\",IF(L2=2,\"E\",IF(L2=3,\"W\",IF(L2=4,\"W\"))))","v":{"$error":"#VALUE!"}},{"$f":"IF(L2=1,K2,IF(L2=2,180-K2,IF(L2=3,K2-180,IF(L2=4,360-K2))))","v":{"$error":"#VALUE!"}},{"$f":"ROUNDDOWN(K2,0)&\"°\"&ROUNDDOWN((K2-ROUNDDOWN(K2,0))*60,0)&\"'\"&(ROUNDDOWN((((K2-ROUNDDOWN(K2,0))*60)-(ROUNDDOWN(((K2-ROUNDDOWN(K2,0))*60),0)))*60,2))&\"''\"","v":{"$error":"#VALUE!"}},{"$f":"ROUNDDOWN(O2,0)&\"°\"&ROUNDDOWN((O2-ROUNDDOWN(O2,0))*60,0)&\"'\"&(ROUNDDOWN((((O2-ROUNDDOWN(O2,0))*60)-(ROUNDDOWN(((O2-ROUNDDOWN(O2,0))*60),0)))*60,2))&\"''\"","v":{"$error":"#VALUE!"}},{"$f":"M2&\" \"&Q2&\" \"&N2","v":{"$error":"#VALUE!"}}]
[{"$f":"'CUADRO INFORMATIVO'!F6","v":0},{"$f":"'CUADRO INFORMATIVO'!G6","v":" "},{"$f":"'CUADRO INFORMATIVO'!H6","v":" "},{"$f":"IF(B3<>0,IF(B4=0,$B$2-B3,B4-B3),0)","v":{"$error":"#VALUE!"}},{"$f":"IF(C3<>0,IF(C4=0,$C$2-C3,C4-C3),0)","v":{"$error":"#VALUE!"}},{"$f":"SQRT((D3^2)+(E3^2))","v":{"$error":"#VALUE!"}},{"$f":"A3&\" - \"&A4","v":"0 - 0"},{"$f":"IF(D3>=0,\"+\",\"-\")&IF(E3>=0,\"+\",\"-\")","v":{"$error":"#VALUE!"}},{"$error":"#VALUE!"},{"$f":"IF(H3=\"++\",I3,IF(H3=\"+-\",I3,IF(H3=\"-+\",I3-180,IF(H3=\"--\",I3+180))))","v":{"$error":"#VALUE!"}},{"$f":"IF(J3>=0,J3,360+J3)","v":{"$error":"#VALUE!"}},{"$f":"IF(K3<=90,1,IF(K3<=180,2,IF(K3<=270,3,IF(K3<=360,4))))","v":{"$error":"#VALUE!"}},{"$f":"IF(L3=1,\"N\",IF(L3=2,\"S\",IF(L3=3,\"S\",IF(L3=4,\"N\"))))","v":{"$error":"#VALUE!"}},{"$f":"IF(L3=1,\"E\",IF(L3=2,\"E\",IF(L3=3,\"W\",IF(L3=4,\"W\"))))","v":{"$error":"#VALUE!"}},{"$error":"#VALUE!"},{"$error":"#VALUE!"},{"$f":"ROUNDDOWN(O3,0)&\"°\"&ROUNDDOWN((O3-ROUNDDOWN(O3,0))*60,0)&\"'\"&(ROUNDDOWN((((O3-ROUNDDOWN(O3,0))*60)-(ROUNDDOWN(((O3-ROUNDDOWN(O3,0))*60),0)))*60,2))&\"''\"","v":{"$error":"#VALUE!"}},{"$f":"M3&\" \"&Q3&\" \"&N3","v":{"$error":"#VALUE!"}}]
[{"$f":"'CUADRO INFORMATIVO'!F7","v":0},{"$f":"'CUADRO INFORMATIVO'!G7","v":" "},{"$f":"'CUADRO INFORMATIVO'!H7","v":" "},{"$f":"IF(B4<>0,IF(B5=0,$B$2-B4,B5-B4),0)","v":{"$error":"#VALUE!"}},{"$f":"IF(C4<>0,IF(C5=0,$C$2-C4,C5-C4),0)","v":{"$error":"#VALUE!"}},{"$error":"#VALUE!"},"0 - 0",{"$error":"#VALUE!"},{"$error":"#VALUE!"},{"$error":"#VALUE!"},{"$error":"#VALUE!"},{"$error":"#VALUE!"},{"$error":"#VALUE!"},{"$error":"#VALUE!"},{"$error":"#VALUE!"},{"$error":"#VALUE!"},{"$error":"#VALUE!"},{"$error":"#VALUE!"}]
[{"$f":"'CUADRO INFORMATIVO'!F8","v":0},{"$f":"'CUADRO INFORMATIVO'!G8","v":" "},{"$f":"'CUADRO INFORMATIVO'!H8","v":" "},{"$error":"#VALUE!"},{"$error":"#VALUE!"},{"$error":"#VALUE!"},"0 - 0",{"$error":"#VALUE!"},{"$error":"#VALUE!"},{"$error":"#VALUE!"},{"$error":"#VALUE!"},{"$error":"#VALUE!"},{"$error":"#VALUE!"},{"$error":"#VALUE!"},{"$error":"#VALUE!"},{"$error":"#VALUE!"},{"$error":"#VALUE!"},{"$error":"#VALUE!"}]
[{"$f":"'CUADRO INFORMATIVO'!F9","v":0},{"$f":"'CUADRO INFORMATIVO'!G9","v":" "},{"$f":"'CUADRO INFORMATIVO'!H9","v":" "},{"$error":"#VALUE!"},{"$error":"#VALUE!"},{"$error":"#VALUE!"},"0 - 0",{"$error":"#VALUE!"},{"$error":"#VALUE!"},{"$error":"#VALUE!"},{"$error":"#VALUE!"},{"$error":"#VALUE!"},{"$error":"#VALUE!"},{"$error":"#VALUE!"},{"$error":"#VALUE!"},{"$error":"#VALUE!"},{"$error":"#VALUE!"},{"$error":"#VALUE!"}]
[{"$f":"'CUADRO INFORMATIVO'!F10","v":0},{"$f":"'CUADRO INFORMATIVO'!G10","v":" "},{"$f":"'CUADRO INFORMATIVO'!H10","v":" "},{"$error":"#VALUE!"},{"$error":"#VALUE!"},{"$error":"#VALUE!"},"0 - 0",{"$error":"#VALUE!"},{"$error":"#VALUE!"},{"$error":"#VALUE!"},{"$error":"#VALUE!"},{"$error":"#VALUE!"},{"$error":"#VALUE!"},{"$error":"#VALUE!"},{"$error":"#VALUE!"},{"$error":"#VALUE!"},{"$error":"#VALUE!"},{"$error":"#VALUE!"}]
[{"$f":"'CUADRO INFORMATIVO'!F11","v":0},{"$f":"'CUADRO INFORMATIVO'!G11","v":" "},{"$f":"'CUADRO INFORMATIVO'!H11","v":" "},{"$error":"#VALUE!"},{"$error":"#VALUE!"},{"$error":"#VALUE!"},"0 - 0",{"$error":"#VALUE!"},{"$error":"#VALUE!"},{"$error":"#VALUE!"},{"$error":"#VALUE!"},{"$error":"#VALUE!"},{"$error":"#VALUE!"},{"$error":"#VALUE!"},{"$error":"#VALUE!"},{"$error":"#VALUE!"},{"$error":"#VALUE!"},{"$error":"#VALUE!"}]
[{"$f":"'CUADRO INFORMATIVO'!F12","v":0},{"$f":"'CUADRO INFORMATIVO'!G12","v":" "},{"$f":"'CUADRO INFORMATIVO'!H12","v":" "},{"$error":"#VALUE!"},{"$error":"#VALUE!"},{"$error":"#VALUE!"},"0 - 0",{"$error":"#VALUE!"},{"$error":"#VALUE!"},{"$error":"#VALUE!"},{"$error":"#VALUE!"},{"$error":"#VALUE!"},{"$error":"#VALUE!"},{"$error":"#VALUE!"},{"$error":"#VALUE!"},{"$error":"#VALUE!"},{"$error":"#VALUE!"},{"$error":"#VALUE!"}]
[{"$f":"'CUADRO INFORMATIVO'!F13","v":0},{"$f":"'CUADRO INFORMATIVO'!G13","v":" "},{"$f":"'CUADRO INFORMATIVO'!H13","v":" "},{"$error":"#VALUE!"},{"$error":"#VALUE!"},{"$error":"#VALUE!"},"0 - 0",{"$error":"#VALUE!"},{"$error":"#VALUE!"},{"$error":"#VALUE!"},{"$error":"#VALUE!"},{"$error":"#VALUE!"},{"$error":"#VALUE!"},{"$error":"#VALUE!"},{"$error":"#VALUE!"},{"$error":"#VALUE!"},{"$error":"#VALUE!"},{"$error":"#VALUE!"}]
[{"$f":"'CUADRO INFORMATIVO'!F14","v":0},{"$f":"'CUADRO INFORMATIVO'!G14","v":" "},{"$f":"'CUADRO INFORMATIVO'!H14","v":" "},{"$error":"#VALUE!"},{"$error":"#VALUE!"},{"$error":"#VALUE!"},"0 - 0",{"$error":"#VALUE!"},{"$error":"#VALUE!"},{"$error":"#VALUE!"},{"$error":"#VALUE!"},{"$error":"#VALUE!"},{"$error":"#VALUE!"},{"$error":"#VALUE!"},{"$error":"#VALUE!"},{"$error":"#VALUE!"},{"$error":"#VALUE!"},{"$error":"#VALUE!"}]
[{"$f":"'CUADRO INFORMATIVO'!F15","v":0},{"$f":"'CUADRO INFORMATIVO'!G15","v":" "},{"$f":"'CUADRO INFORMATIVO'!H15","v":" "},{"$error":"#VALUE!"},{"$error":"#VALUE!"},{"$error":"#VALUE!"},"0 - 0",{"$error":"#VALUE!"},{"$error":"#VALUE!"},{"$error":"#VALUE!"},{"$error":"#VALUE!"},{"$f":"IF(K12<=90,1,IF(K12<=180,2,IF(K12<=270,3,IF(K12<=360,4))))","v":{"$error":"#VALUE!"}},{"$error":"#VALUE!"},{"$error":"#VALUE!"},{"$error":"#VALUE!"},{"$error":"#VALUE!"},{"$error":"#VALUE!"},{"$error":"#VALUE!"}]
[{"$f":"'CUADRO INFORMATIVO'!F16","v":0},{"$f":"'CUADRO INFORMATIVO'!G16","v":" "},{"$f":"'CUADRO INFORMATIVO'!H16","v":" "},{"$error":"#VALUE!"},{"$error":"#VALUE!"},{"$error":"#VALUE!"},"0 - 0",{"$error":"#VALUE!"},{"$error":"#VALUE!"},{"$error":"#VALUE!"},{"$error":"#VALUE!"},{"$error":"#VALUE!"},{"$error":"#VALUE!"},{"$error":"#VALUE!"},{"$error":"#VALUE!"},{"$error":"#VALUE!"},{"$error":"#VALUE!"},{"$error":"#VALUE!"}]
[{"$f":"'CUADRO INFORMATIVO'!F17","v":0},{"$f":"'CUADRO INFORMATIVO'!G17","v":" "},{"$f":"'CUADRO INFORMATIVO'!H17","v":" "},{"$error":"#VALUE!"},{"$error":"#VALUE!"},{"$error":"#VALUE!"},"0 - 0",{"$error":"#VALUE!"},{"$error":"#VALUE!"},{"$error":"#VALUE!"},{"$error":"#VALUE!"},{"$error":"#VALUE!"},{"$error":"#VALUE!"},{"$error":"#VALUE!"},{"$error":"#VALUE!"},{"$error":"#VALUE!"},{"$error":"#VALUE!"},{"$error":"#VALUE!"}]
[{"$f":"'CUADRO INFORMATIVO'!F18","v":0},{"$f":"'CUADRO INFORMATIVO'!G18","v":" "},{"$f":"'CUADRO INFORMATIVO'!H18","v":" "},{"$error":"#VALUE!"},{"$error":"#VALUE!"},{"$error":"#VALUE!"},"0 - 0",{"$error":"#VALUE!"},{"$error":"#VALUE!"},{"$error":"#VALUE!"},{"$error":"#VALUE!"},{"$error":"#VALUE!"},{"$error":"#VALUE!"},{"$error":"#VALUE!"},{"$error":"#VALUE!"},{"$error":"#VALUE!"},{"$error":"#VALUE!"},{"$error":"#VALUE!"}]
[{"$f":"'CUADRO INFORMATIVO'!F19","v":0},{"$f":"'CUADRO INFORMATIVO'!G19","v":" "},{"$f":"'CUADRO INFORMATIVO'!H19","v":" "},{"$error":"#VALUE!"},{"$error":"#VALUE!"},{"$error":"#VALUE!"},"0 - 0",{"$error":"#VALUE!"},{"$error":"#VALUE!"},{"$error":"#VALUE!"},{"$error":"#VALUE!"},{"$error":"#VALUE!"},{"$error":"#VALUE!"},{"$error":"#VALUE!"},{"$error":"#VALUE!"},{"$error":"#VALUE!"},{"$error":"#VALUE!"},{"$error":"#VALUE!"}]
[{"$f":"'CUADRO INFORMATIVO'!F20","v":0},{"$f":"'CUADRO INFORMATIVO'!G20","v":" "},{"$f":"'CUADRO INFORMATIVO'!H20","v":" "},{"$error":"#VALUE!"},{"$error":"#VALUE!"},{"$error":"#VALUE!"},"0 - 0",{"$error":"#VALUE!"},{"$error":"#VALUE!"},{"$error":"#VALUE!"},{"$error":"#VALUE!"},{"$error":"#VALUE!"},{"$error":"#VALUE!"},{"$error":"#VALUE!"},{"$error":"#VALUE!"},{"$error":"#VALUE!"},{"$error":"#VALUE!"},{"$error":"#VALUE!"}]
[{"$f":"'CUADRO INFORMATIVO'!F21","v":0},{"$f":"'CUADRO INFORMATIVO'!G21","v":" "},{"$f":"'CUADRO INFORMATIVO'!H21","v":" "},{"$error":"#VALUE!"},{"$error":"#VALUE!"},{"$error":"#VALUE!"},"0 - 0",{"$error":"#VALUE!"},{"$error":"#VALUE!"},{"$error":"#VALUE!"},{"$error":"#VALUE!"},{"$error":"#VALUE!"},{"$error":"#VALUE!"},{"$error":"#VALUE!"},{"$error":"#VALUE!"},{"$error":"#VALUE!"},{"$error":"#VALUE!"},{"$error":"#VALUE!"}]
[{"$f":"'CUADRO INFORMATIVO'!F22","v":0},{"$f":"'CUADRO INFORMATIVO'!G22","v":" "},{"$f":"'CUADRO INFORMATIVO'!H22","v":" "},{"$error":"#VALUE!"},{"$error":"#VALUE!"},{"$error":"#VALUE!"},"0 - 0",{"$error":"#VALUE!"},{"$error":"#VALUE!"},{"$error":"#VALUE!"},{"$error":"#VALUE!"},{"$error":"#VALUE!"},{"$error":"#VALUE!"},{"$error":"#VALUE!"},{"$error":"#VALUE!"},{"$error":"#VALUE!"},{"$error":"#VALUE!"},{"$error":"#VALUE!"}]
[{"$f":"'CUADRO INFORMATIVO'!F23","v":0},{"$f":"'CUADRO INFORMATIVO'!G23","v":" "},{"$f":"'CUADRO INFORMATIVO'!H23","v":" "},{"$error":"#VALUE!"},{"$error":"#VALUE!"},{"$error":"#VALUE!"},"0 - 0",{"$error":"#VALUE!"},{"$error":"#VALUE!"},{"$error":"#VALUE!"},{"$error":"#VALUE!"},{"$error":"#VALUE!"},{"$error":"#VALUE!"},{"$error":"#VALUE!"},{"$error":"#VALUE!"},{"$error":"#VALUE!"},{"$error":"#VALUE!"},{"$error":"#VALUE!"}]
[{"$f":"'CUADRO INFORMATIVO'!F24","v":0},{"$f":"'CUADRO INFORMATIVO'!G24","v":" "},{"$f":"'CUADRO INFORMATIVO'!H24","v":" "},{"$error":"#VALUE!"},{"$error":"#VALUE!"},{"$error":"#VALUE!"},"0 - 0",{"$error":"#VALUE!"},{"$error":"#VALUE!"},{"$error":"#VALUE!"},{"$error":"#VALUE!"},{"$error":"#VALUE!"},{"$error":"#VALUE!"},{"$error":"#VALUE!"},{"$error":"#VALUE!"},{"$error":"#VALUE!"},{"$error":"#VALUE!"},{"$error":"#VALUE!"}]
[{"$f":"'CUADRO INFORMATIVO'!F25","v":0},{"$f":"'CUADRO INFORMATIVO'!G25","v":" "},{"$f":"'CUADRO INFORMATIVO'!H25","v":" "},{"$error":"#VALUE!"},{"$error":"#VALUE!"},{"$error":"#VALUE!"},"0 - 0",{"$error":"#VALUE!"},{"$error":"#VALUE!"},{"$error":"#VALUE!"},{"$error":"#VALUE!"},{"$error":"#VALUE!"},{"$error":"#VALUE!"},{"$error":"#VALUE!"},{"$error":"#VALUE!"},{"$error":"#VALUE!"},{"$error":"#VALUE!"},{"$error":"#VALUE!"}]
[{"$f":"'CUADRO INFORMATIVO'!F26","v":0},{"$f":"'CUADRO INFORMATIVO'!G26","v":" "},{"$f":"'CUADRO INFORMATIVO'!H26","v":" "},{"$error":"#VALUE!"},{"$error":"#VALUE!"},{"$error":"#VALUE!"},"0 - 0",{"$error":"#VALUE!"},{"$error":"#VALUE!"},{"$error":"#VALUE!"},{"$error":"#VALUE!"},{"$error":"#VALUE!"},{"$error":"#VALUE!"},{"$error":"#VALUE!"},{"$error":"#VALUE!"},{"$error":"#VALUE!"},{"$error":"#VALUE!"},{"$error":"#VALUE!"}]
[{"$f":"'CUADRO INFORMATIVO'!F27","v":0},{"$f":"'CUADRO INFORMATIVO'!G27","v":" "},{"$f":"'CUADRO INFORMATIVO'!H27","v":" "},{"$error":"#VALUE!"},{"$error":"#VALUE!"},{"$error":"#VALUE!"},"0 - 0",{"$error":"#VALUE!"},{"$error":"#VALUE!"},{"$error":"#VALUE!"},{"$error":"#VALUE!"},{"$error":"#VALUE!"},{"$error":"#VALUE!"},{"$error":"#VALUE!"},{"$error":"#VALUE!"},{"$error":"#VALUE!"},{"$error":"#VALUE!"},{"$error":"#VALUE!"}]
[{"$f":"'CUADRO INFORMATIVO'!F28","v":0},{"$f":"'CUADRO INFORMATIVO'!G28","v":" "},{"$f":"'CUADRO INFORMATIVO'!H28","v":" "},{"$error":"#VALUE!"},{"$error":"#VALUE!"},{"$error":"#VALUE!"},"0 - 0",{"$error":"#VALUE!"},{"$error":"#VALUE!"},{"$error":"#VALUE!"},{"$error":"#VALUE!"},{"$error":"#VALUE!"},{"$error":"#VALUE!"},{"$error":"#VALUE!"},{"$error":"#VALUE!"},{"$error":"#VALUE!"},{"$error":"#VALUE!"},{"$error":"#VALUE!"}]
[{"$f":"'CUADRO INFORMATIVO'!F29","v":0},{"$f":"'CUADRO INFORMATIVO'!G29","v":" "},{"$f":"'CUADRO INFORMATIVO'!H29","v":" "},{"$error":"#VALUE!"},{"$error":"#VALUE!"},{"$error":"#VALUE!"},"0 - 0",{"$error":"#VALUE!"},{"$error":"#VALUE!"},{"$error":"#VALUE!"},{"$error":"#VALUE!"},{"$error":"#VALUE!"},{"$error":"#VALUE!"},{"$error":"#VALUE!"},{"$error":"#VALUE!"},{"$error":"#VALUE!"},{"$error":"#VALUE!"},{"$error":"#VALUE!"}]
[{"$f":"'CUADRO INFORMATIVO'!F30","v":0},{"$f":"'CUADRO INFORMATIVO'!G30","v":" "},{"$f":"'CUADRO INFORMATIVO'!H30","v":" "},{"$error":"#VALUE!"},{"$error":"#VALUE!"},{"$error":"#VALUE!"},"0 - 0",{"$error":"#VALUE!"},{"$error":"#VALUE!"},{"$error":"#VALUE!"},{"$error":"#VALUE!"},{"$error":"#VALUE!"},{"$error":"#VALUE!"},{"$error":"#VALUE!"},{"$error":"#VALUE!"},{"$error":"#VALUE!"},{"$error":"#VALUE!"},{"$error":"#VALUE!"}]
[{"$f":"'CUADRO INFORMATIVO'!F31","v":0},{"$f":"'CUADRO INFORMATIVO'!G31","v":" "},{"$f":"'CUADRO INFORMATIVO'!H31","v":" "},{"$error":"#VALUE!"},{"$error":"#VALUE!"},{"$error":"#VALUE!"},"0 - 0",{"$error":"#VALUE!"},{"$error":"#VALUE!"},{"$error":"#VALUE!"},{"$error":"#VALUE!"},{"$error":"#VALUE!"},{"$error":"#VALUE!"},{"$error":"#VALUE!"},{"$error":"#VALUE!"},{"$error":"#VALUE!"},{"$error":"#VALUE!"},{"$error":"#VALUE!"}]
[{"$f":"'CUADRO INFORMATIVO'!F32","v":0},{"$f":"'CUADRO INFORMATIVO'!G32","v":" "},{"$f":"'CUADRO INFORMATIVO'!H32","v":" "},{"$error":"#VALUE!"},{"$error":"#VALUE!"},{"$error":"#VALUE!"},"0 - 0",{"$error":"#VALUE!"},{"$error":"#VALUE!"},{"$error":"#VALUE!"},{"$error":"#VALUE!"},{"$error":"#VALUE!"},{"$error":"#VALUE!"},{"$error":"#VALUE!"},{"$error":"#VALUE!"},{"$error":"#VALUE!"},{"$error":"#VALUE!"},{"$error":"#VALUE!"}]
[{"$f":"'CUADRO INFORMATIVO'!F33","v":0},{"$f":"'CUADRO INFORMATIVO'!G33","v":" "},{"$f":"'CUADRO INFORMATIVO'!H33","v":" "},{"$error":"#VALUE!"},{"$error":"#VALUE!"},{"$error":"#VALUE!"},"0 - 0",{"$error":"#VALUE!"},{"$error":"#VALUE!"},{"$error":"#VALUE!"},{"$error":"#VALUE!"},{"$error":"#VALUE!"},{"$error":"#VALUE!"},{"$error":"#VALUE!"},{"$error":"#VALUE!"},{"$error":"#VALUE!"},{"$error":"#VALUE!"},{"$error":"#VALUE!"}]
{"$rows_left_out":289}